{"text_format":"1","workbook":"xlsx","n_sheets":21,"sheets":["Monthly headcount","POSITION CATALOG","PROGRESSIVE POSITIONS","ORGCHAPPLIANCEASSEMBLY","ORGCHAPPLIANCEMETALMECHANIC","ORGCHAPPLIANCEPLASTICINJECTION","ORGCHAPPLIANCEPLASTICEXTRUSION","ORGCHAEROSPACESHEETMETALASSEMBL","ORGCHAEROSPACEWIREHARNESSES","ORGCHAEROSPACEMACHINING","ORGCHAUTOMOTIVEMETALMECHANIC","ORGCHAUTOMOTIVEPLASTICINJECTION","ORGCHAUTOMOTIVEWIREHARNESSES","ORGCHELECTRONICASSEMBLY","ORGCHELECTRONICREPAIR","ORGCHAUTOMOTIVEASSEMBLY","Shelter Services Questionnaire","PuestosIndustriaProceso_Catalog","PuestosIndustriaProceso","Listas","Currencies"],"not_rendered":{"charts":0,"images":9,"macros":1,"external_links":0,"defined_names":393,"comments":1,"pivot_tables":0},"unopened":[],"bounds":{"document_bytes":16777216,"sheet_cells":100000,"rows_first":2000,"rows_last":500,"rows_between":2000,"halvings":0,"cell_chars":16384,"cell_head_chars":4096},"cells_cut":0,"cells_raw":0,"read":"whole","date_system":"1900"}

{"sheet":"Monthly headcount","index":0,"n_rows":68,"n_cols":16,"rows_kept":68,"cut":false,"hidden":true,"merged":[[3,3,3,6],[3,7,4,7]]}
[]
["Headcount Calculation"]
[null,null,null,null,null,null,null,null,null,null,null,{"$f":"COLUMN()-COLUMN($B$3)+1","v":11},{"$f":"COLUMN()-COLUMN($B$3)+1","v":12},13,14,15]
[null,null,null,"DRIVERS SUMA",null,null,null,"QTY\nSUMA",null,null,null,{"$f":"'Shelter Services Questionnaire'!E73:I73","v":1},2,3,4,5]
["CLASS","#","POSITION","D1","D2","D3","D4",null,"Tope","Start","Level"]
["Direct positions"]
{"$rows_left_out":63}
{"sheet":"POSITION CATALOG","index":1,"n_rows":257,"n_cols":31,"rows_kept":257,"cut":false,"hidden":true,"merged":[]}
[]
[null,null,"xx","xx"]
["Position Number","SOC Number","Category","Payment","Area","Group","Position","Job Responsibilities","Competencies","CODIGO INDEX '15","CODIGO JUAREZ '15","CODIGO MERCER","CODIGO MERCER","CODIGO MERCER","CODIGO MERCER","CODIGO MERCER","CODIGO MERCER","CODIGO MERCER","CODIGO MERCER","Changing Level Position","Starting month","Progression Position","Competencies description",null,null,"Intermex",null,"Q1","MED","Q3","CODIGO JUAREZ '15"]
[1,"11-1021","ADM","SAL","Management","Manufacturing","Plant Manager","* Oversee activities directly related to making products or providing services. * Direct and coordinate activities of businesses or departments concerned with the production, pricing, sales, or distribution of products. * Review financial statements, sales and activity reports, and other performance data to measure productivity and goal achievement and to determine areas needing cost reduction and program improvement. * Manage staff, preparing work schedules and assigning specific duties. * Direct and coordinate organization's financial and budget activities to fund operations, maximize investments, and increase efficiency. * Establish and implement departmental policies, goals, objectives, and procedures, conferring with board members, organization officials, and staff members as necessary.","100-2-007/100-2-014/100-2-016/100-3-005,200-1-001,300-16,300-20,300-11,400-9,400-31,400-19,400-14,500-7,500-13,600,2,600-1,600-4,600-8","10.10.02","I.2","100.100.113","100.100.113",null,"100.100.113",null,"100.100.113","100.100.113",null,null,null,{"$f":"IF(T4<>\"\",VLOOKUP(T4,ProgressivePositions,6,FALSE),\"\")","v":""},"100 - Education\n[100-2-007]Industrial Engineer or [100-2-014]Industrial and Systems Engineer or [100-2-016]Industrial and Administrator Engineer or [100-3-005]Business Administration\n200 - Language\n[200-1-001]Advanced English, [2]\n300 - Knowledge\n[300-16]Production and Processing, [300-20]Quality Control, [300-11]Engineering and Technology\n400 - Experience\n[400-9]Minimum 9 years experience in similar position, [400-31]Team Work, [400-19]New Projects Development and Implementation, [400-14]Lean Manufacturing\n500 - Skills\n[500-7]Judgement and Decision Making, [500-13]Change Adaptation\n600 - Work Values\n[600], [600-1]Strong Work Ethic, [600-4]Honesty and Integrity, [600-8]Loyalty",null,null,3055.9716249999997,3055.9716249999997,{"$f":"87926/30","v":2930.8666666666668},{"$f":"98867/30","v":3295.5666666666666},{"$f":"110495/30","v":3683.1666666666665},"I.2"]
[1,"11-1021","ADM","SAL","Management","Manufacturing","Operations Manager","* Oversee activities directly related to making products or providing services. * Direct and coordinate activities of businesses or departments concerned with the production, pricing, sales, or distribution of products. * Review financial statements, sales and activity reports, and other performance data to measure productivity and goal achievement and to determine areas needing cost reduction and program improvement. * Manage staff, preparing work schedules and assigning specific duties. * Direct and coordinate organization's financial and budget activities to fund operations, maximize investments, and increase efficiency. * Establish and implement departmental policies, goals, objectives, and procedures, conferring with board members, organization officials, and staff members as necessary.","100-2-007/100-2-014/100-2-016/100-3-005,200-1-001,300-16,300-20,300-11,400-9,400-31,400-19,400-14,500-7,500-13,600-2,600-4,600-8","10.10.02","I.2","100.100.114","100.100.114",null,"100.100.113",null,"100.100.113","100.100.114",null,null,null,"","100 - Education\n[100-2-007]Industrial Engineer or [100-2-014]Industrial and Systems Engineer or [100-2-016]Industrial and Administrator Engineer or [100-3-005]Business Administration\n200 - Language\n[200-1-001]Advanced English\n300 - Knowledge\n[300-16]Production and Processing, [300-20]Quality Control, [300-11]Engineering and Technology\n400 - Experience\n[400-9]Minimum 9 years experience in similar position, [400-31]Team Work, [400-19]New Projects Development and Implementation, [400-14]Lean Manufacturing\n500 - Skills\n[500-7]Judgement and Decision Making, [500-13]Change Adaptation\n600 - Work Values\n[600-2]Dependability and Responsability, [600-4]Honesty and Integrity, [600-8]Loyalty",null,null,3055.9716249999997,3055.9716249999997,{"$f":"87926/30","v":2930.8666666666668},{"$f":"98867/30","v":3295.5666666666666},{"$f":"110495/30","v":3683.1666666666665},"I.2"]
[1,"11-1021","ADM","SAL","Management","Manufacturing","General Manager","* Oversee activities directly related to making products or providing services. * Direct and coordinate activities of businesses or departments concerned with the production, pricing, sales, or distribution of products. * Review financial statements, sales and activity reports, and other performance data to measure productivity and goal achievement and to determine areas needing cost reduction and program improvement. * Manage staff, preparing work schedules and assigning specific duties. * Direct and coordinate organization's financial and budget activities to fund operations, maximize investments, and increase efficiency. * Establish and implement departmental policies, goals, objectives, and procedures, conferring with board members, organization officials, and staff members as necessary.","100-2-007/100-2-014/100-2-016/100-3-005,200-1-001,300-16,300-20,300-11,400-5,400-31,400-19,400-14,500-7,500-13,600,2,600-4","10.10.02","I.2","100.100.115","100.100.115",null,"100.100.113",null,"100.100.113","100.100.115",null,null,null,"","100 - Education\n[100-2-007]Industrial Engineer or [100-2-014]Industrial and Systems Engineer or [100-2-016]Industrial and Administrator Engineer or [100-3-005]Business Administration\n200 - Language\n[200-1-001]Advanced English, [2]\n300 - Knowledge\n[300-16]Production and Processing, [300-20]Quality Control, [300-11]Engineering and Technology\n400 - Experience\n[400-5]Minimum 5 years experience in similar position, [400-31]Team Work, [400-19]New Projects Development and Implementation, [400-14]Lean Manufacturing\n500 - Skills\n[500-7]Judgement and Decision Making, [500-13]Change Adaptation\n600 - Work Values\n[600], [600-4]Honesty and Integrity",null,null,3055.9716249999997,3055.9716249999997,{"$f":"87926/30","v":2930.8666666666668},{"$f":"98867/30","v":3295.5666666666666},{"$f":"110495/30","v":3683.1666666666665},"I.2"]
{"$rows_left_out":252}
{"sheet":"PROGRESSIVE POSITIONS","index":2,"n_rows":20,"n_cols":6,"rows_kept":20,"cut":false,"hidden":true,"merged":[]}
[]
[]
["Clave","Categoria","Pago","Industria","Proceso","Position"]
["OP01","DIR","HOU","AEROSPACE","SHEET METAL ASSEMBLY","Production Operator (Aerospace - Sheet Metal Assembly)"]
["OP02","DIR","HOU","AEROSPACE","WIRE HARNESSES","Production Operator (Aerospace - Wire harnesses)"]
["OP03","DIR","HOU","AEROSPACE","MACHINING","Production Operator (Aerospace - Machining)"]
{"$rows_left_out":15}
{"sheet":"ORGCHAPPLIANCEASSEMBLY","index":3,"n_rows":31,"n_cols":16,"rows_kept":31,"cut":false,"hidden":true,"merged":[[2,5,2,8],[2,9,4,9],[5,5,5,8],[12,5,12,8],[13,5,13,8],[14,5,14,8]]}
[null,null,null,"INDUSTRY","APPLIANCE"]
[null,null,null,"PROCESS","ASSEMBLY"]
[null,null,null,"Clase Riesgo Trabajo","Clase III   ","DRIVERS SUMA",null,null,null,"QTY\nSUMA"]
[null,null,null,"Origen","Org Chart B M P Electrodomesticos Textil 2016"]
["CLASS","TYPE","#","ID","POSITION","D1","D2","D3","D4",null,"Max","Start","Nivel","Meses","Progresion","Distribute on shifts"]
["DIR","HOU",1,"DIR-HOU-1","Operator","RAMP UP",null,null,null,null,null,null,"OP14",null,null,"YES"]
{"$rows_left_out":26}
{"sheet":"ORGCHAPPLIANCEMETALMECHANIC","index":4,"n_rows":38,"n_cols":16,"rows_kept":38,"cut":false,"hidden":true,"merged":[[2,5,2,8],[2,9,4,9],[5,5,5,8],[13,5,13,8],[14,5,14,8],[15,5,15,8]]}
[null,null,null,"INDUSTRY","APPLIANCE"]
[null,null,null,"PROCESS","METAL MECHANIC"]
[null,null,null,"Clase Riesgo Trabajo","Clase III   ","DRIVERS SUMA",null,null,null,"QTY\nSUMA"]
[null,null,null,"Origen","Org Chart Borg Warner Automotriz 2016"]
["CLASS","TYPE","#","ID","POSITION","D1","D2","D3","D4",null,"Max","Start","Nivel","Meses","Progresion","Distribute on shifts"]
["DIR","HOU",1,"DIR-HOU-1","Operator","RAMP UP",null,null,null,null,null,null,"OP13",null,null,"YES"]
{"$rows_left_out":33}
{"sheet":"ORGCHAPPLIANCEPLASTICINJECTION","index":5,"n_rows":36,"n_cols":16,"rows_kept":36,"cut":false,"hidden":true,"merged":[[2,5,2,8],[2,9,4,9],[5,5,5,8],[13,5,13,8],[14,5,14,8],[15,5,15,8]]}
[null,null,null,"INDUSTRY","APPLIANCE"]
[null,null,null,"PROCESS","PLASTIC INJECTION MOLDING"]
[null,null,null,"Clase Riesgo Trabajo","Clase III   ","DRIVERS SUMA",null,null,null,"QTY\nSUMA"]
[null,null,null,"Origen","Org Chart Master Presition Electrodomesticos Inyeccion de Plastico 2016"]
["CLASS","TYPE","#","ID","POSITION","D1","D2","D3","D4",null,"Max","Start","Nivel","Meses","Progresion","Distribute on shifts"]
["DIR","HOU",1,"DIR-HOU-1","Operator","RAMP UP",null,null,null,null,null,null,"OP12",null,null,"YES"]
{"$rows_left_out":31}
{"sheet":"ORGCHAPPLIANCEPLASTICEXTRUSION","index":6,"n_rows":36,"n_cols":16,"rows_kept":36,"cut":false,"hidden":true,"merged":[[2,5,2,8],[2,9,4,9],[5,5,5,8],[13,5,13,8],[14,5,14,8],[15,5,15,8]]}
[null,null,null,"INDUSTRY","APPLIANCE"]
[null,null,null,"PROCESS","PLASTIC EXTRUSION"]
[null,null,null,"Clase Riesgo Trabajo","Clase III   ","DRIVERS SUMA",null,null,null,"QTY\nSUMA"]
[null,null,null,"Origen","Org Chart Custom Profile Electrodomesticos Extrusion de Plastico 2016"]
["CLASS","TYPE","#","ID","POSITION","D1","D2","D3","D4",null,"Max","Start","Nivel","Meses","Progresion","Distribute on shifts"]
["DIR","HOU",1,"DIR-HOU-1","Operator","RAMP UP",null,null,null,null,null,null,"OP11",null,null,"YES"]
{"$rows_left_out":31}
{"sheet":"ORGCHAEROSPACESHEETMETALASSEMBL","index":7,"n_rows":43,"n_cols":16,"rows_kept":43,"cut":false,"hidden":true,"merged":[[2,5,2,8],[2,9,4,9],[5,5,5,8],[13,5,13,8],[14,5,14,8],[15,5,15,8]]}
[null,null,null,"INDUSTRY","AEROSPACE"]
[null,null,null,"PROCESS","SHEET METAL ASSEMBLY"]
[null,null,null,"Clase Riesgo Trabajo","Clase III   ","DRIVERS SUMA",null,null,null,"QTY\nSUMA"]
[null,null,null,"Origen","Org Chart Bell Aeroespacial Sheet Metal 2016"]
["CLASS","TYPE","#","ID","POSITION","D1","D2","D3","D4",null,"Max","Start","Nivel","Meses","Progresion","Distribute on shifts"]
["DIR","HOU",1,"DIR-HOU-1","Operator","RAMP UP",null,null,null,null,null,null,"OP01",null,null,"YES"]
{"$rows_left_out":38}
{"sheet":"ORGCHAEROSPACEWIREHARNESSES","index":8,"n_rows":43,"n_cols":16,"rows_kept":43,"cut":false,"hidden":true,"merged":[[2,5,2,8],[2,9,4,9],[5,5,5,8]]}
[null,null,null,"INDUSTRY","AEROSPACE"]
[null,null,null,"PROCESS","WIRE HARNESSES"]
[null,null,null,"Clase Riesgo Trabajo","Clase III   ","DRIVERS SUMA",null,null,null,"QTY\nSUMA"]
[null,null,null,"Origen","Org Chart Bell Aeroespacial Wire Harness 2016"]
["CLASS","TYPE","#","ID","POSITION","D1","D2","D3","D4",null,"Max","Start","Nivel","Meses","Progresion","Distribute on shifts"]
["DIR","HOU",1,"DIR-HOU-1","Operator","RAMP UP",null,null,null,null,null,null,"OP02",null,null,"YES"]
{"$rows_left_out":38}
{"sheet":"ORGCHAEROSPACEMACHINING","index":9,"n_rows":47,"n_cols":17,"rows_kept":47,"cut":false,"hidden":true,"merged":[[2,5,2,8],[2,9,4,9],[5,5,5,8],[12,5,12,8],[15,5,15,8],[16,5,16,8]]}
[null,null,null,"INDUSTRY","AEROSPACE"]
[null,null,null,"PROCESS","MACHINING"]
[null,null,null,"Clase Riesgo Trabajo","Clase III   ","DRIVERS SUMA",null,null,null,"QTY\nSUMA"]
[null,null,null,"Origen","Org Chart Manoir Aeroespacial Maquinados 2016"]
["CLASS","TYPE","#","ID","POSITION","D1","D2","D3","D4",null,"Max","Start","Nivel","Meses","Progresion","Distribute on shifts","Sueldo Intermex"]
["DIR","HOU",1,"DIR-HOU-1","CNC Technical Operator","RAMP UP",null,null,null,null,null,null,"OP03",null,null,"YES"]
{"$rows_left_out":42}
{"sheet":"ORGCHAUTOMOTIVEMETALMECHANIC","index":10,"n_rows":38,"n_cols":16,"rows_kept":38,"cut":false,"hidden":true,"merged":[[2,5,2,8],[2,9,4,9],[5,5,5,8],[13,5,13,8],[14,5,14,8],[15,5,15,8]]}
[null,null,null,"INDUSTRY","AUTOMOTIVE"]
[null,null,null,"PROCESS","METAL MECHANIC"]
[null,null,null,"Clase Riesgo Trabajo","Clase III   ","DRIVERS SUMA",null,null,null,"QTY\nSUMA"]
[null,null,null,"Origen","Org Chart Borg Warner Automotriz 2016"]
["CLASS","TYPE","#","ID","POSITION","D1","D2","D3","D4",null,"Max","Start","Nivel","Meses","Progresion","Distribute on shifts"]
["DIR","HOU",1,"DIR-HOU-1","Operator","RAMP UP",null,null,null,null,null,null,"OP04",null,null,"YES"]
{"$rows_left_out":33}
{"sheet":"ORGCHAUTOMOTIVEPLASTICINJECTION","index":11,"n_rows":50,"n_cols":16,"rows_kept":50,"cut":false,"hidden":true,"merged":[[2,5,2,8],[2,9,4,9],[5,5,5,8],[13,5,13,8],[14,5,14,8],[15,5,15,8]]}
[null,null,null,"INDUSTRY","AUTOMOTIVE"]
[null,null,null,"PROCESS","PLASTIC INJECTION MOLDING"]
[null,null,null,"Clase Riesgo Trabajo","Clase III   ","DRIVERS SUMA",null,null,null,"QTY\nSUMA"]
[null,null,null,"Origen","Org Chart Nifco America Automotriz Inyeccion 2016"]
["CLASS","TYPE","#","ID","POSITION","D1","D2","D3","D4",null,"Max","Start","Nivel","Meses","Progresion","Distribute on shifts"]
["DIR","HOU",1,"DIR-HOU-1","Operator","RAMP UP",null,null,null,null,null,null,"OP05",null,null,"YES"]
{"$rows_left_out":45}
{"sheet":"ORGCHAUTOMOTIVEWIREHARNESSES","index":12,"n_rows":42,"n_cols":16,"rows_kept":42,"cut":false,"hidden":true,"merged":[[2,5,2,8],[2,9,4,9],[5,5,5,8]]}
[null,null,null,"INDUSTRY","AUTOMOTIVE"]
[null,null,null,"PROCESS","WIRE HARNESSES"]
[null,null,null,"Clase Riesgo Trabajo","Clase III   ","DRIVERS SUMA",null,null,null,"QTY\nSUMA"]
[null,null,null,"Origen","Org Chart Sumidenso Automotriz Wire Harness 2016"]
["CLASS","TYPE","#","ID","POSITION","D1","D2","D3","D4",null,"Max","Start","Nivel","Meses","Progresion","Distribute on shifts"]
["DIR","HOU",1,"DIR-HOU-1","Operator","RAMP UP",null,null,null,null,null,null,"OP06",null,null,"YES"]
{"$rows_left_out":37}
{"sheet":"ORGCHELECTRONICASSEMBLY","index":13,"n_rows":40,"n_cols":16,"rows_kept":40,"cut":false,"hidden":true,"merged":[[2,5,2,8],[2,9,4,9],[5,5,5,8],[12,5,12,8],[13,5,13,8],[14,5,14,8]]}
[null,null,null,"INDUSTRY","ELECTRONIC"]
[null,null,null,"PROCESS","ASSEMBLY"]
[null,null,null,"Clase Riesgo Trabajo","Clase III   ","DRIVERS SUMA",null,null,null,"QTY\nSUMA"]
[]
["CLASS","TYPE","#","ID","POSITION","D1","D2","D3","D4",null,"Max","Start","Nivel","Meses","Progresion","Distribute on shifts"]
["DIR","HOU",1,"DIR-HOU-1","Operator","RAMP UP",null,null,null,null,null,null,"OP07",null,null,"YES"]
{"$rows_left_out":35}
{"sheet":"ORGCHELECTRONICREPAIR","index":14,"n_rows":38,"n_cols":16,"rows_kept":38,"cut":false,"hidden":true,"merged":[[2,5,2,8],[2,9,4,9],[5,5,5,8],[13,5,13,8],[14,5,14,8],[15,5,15,8]]}
[null,null,null,"INDUSTRY","ELECTRONIC"]
[null,null,null,"PROCESS","REPAIR"]
[null,null,null,"Clase Riesgo Trabajo","Clase III   ","DRIVERS SUMA",null,null,null,"QTY\nSUMA"]
[null,null,null,"Origen","Org Chart CTDI Electronica Reparacion 2016"]
["CLASS","TYPE","#","ID","POSITION","D1","D2","D3","D4",null,"Max","Start","Nivel","Meses","Progresion","Distribute on shifts"]
["DIR","HOU",1,"DIR-HOU-1","Operator","RAMP UP",null,null,null,null,null,null,"OP08",null,null,"YES"]
{"$rows_left_out":33}
{"sheet":"ORGCHAUTOMOTIVEASSEMBLY","index":15,"n_rows":46,"n_cols":16,"rows_kept":46,"cut":false,"hidden":true,"merged":[[2,5,2,8],[2,9,4,9],[5,5,5,8],[13,5,13,8],[14,5,14,8],[15,5,15,8]]}
[null,null,null,"INDUSTRY","AUTOMOTIVE"]
[null,null,null,"PROCESS","ASSEMBLY"]
[null,null,null,"Clase Riesgo Trabajo","Clase III   ","DRIVERS SUMA",null,null,null,"QTY\nSUMA"]
[null,null,null,"Origen","Org Chart Nifco America Automotriz Ensamble 2016"]
["CLASS","TYPE","#","ID","POSITION","D1","D2","D3","D4",null,"Max","Start","Nivel","Meses","Progresion","Distribute on shifts"]
["DIR","HOU",1,"DIR-HOU-1","Operator","RAMP UP",null,null,null,null,null,null,"OP09",null,null,"YES"]
{"$rows_left_out":41}
{"sheet":"Shelter Services Questionnaire","index":16,"n_rows":200,"n_cols":13,"rows_kept":200,"cut":false,"hidden":false,"merged":[[147,1,150,9],[151,1,151,9],[117,1,117,2],[85,1,85,2],[71,1,71,2],[72,1,72,2],[80,1,82,2],[75,1,75,2],[76,1,76,2],[85,4,85,8],[71,4,71,9],[78,4,78,8],[29,5,31,8],[39,2,39,3],[35,2,35,3],[53,1,53,2],[42,2,42,3],[45,2,45,3],[50,1,50,2],[51,1,51,2],[52,1,52,2],[48,4,48,9],[47,1,47,9],[34,2,34,3],[37,2,37,3],[43,2,43,3],[40,2,40,3],[41,2,41,3],[1,2,1,9],[3,1,3,9],[5,2,5,3],[5,4,5,5],[25,2,25,3],[9,2,9,3],[11,2,11,3],[13,2,13,3],[13,4,13,5],[17,2,17,3],[17,4,17,5],[23,1,23,9],[15,2,15,3],[15,4,15,5],[19,2,19,8],[21,2,21,8],[164,1,164,9],[55,1,55,9],[68,1,68,9],[69,3,69,9],[56,1,56,9],[146,1,146,9],[163,1,163,9],[161,1,161,9],[162,1,162,9],[117,4,117,8],[73,1,73,2],[74,1,74,2],[159,1,159,9],[160,1,160,9],[58,4,58,9],[57,3,57,9],[5,6,5,8],[7,2,7,8],[13,6,13,8],[15,6,15,8],[17,6,17,8],[29,2,29,3],[31,2,31,3],[27,2,27,3],[36,2,36,3],[33,2,33,3]]}
[]
[null,null,"SHELTER SERVICES QUESTIONNAIRE"]
[]
[null,"COMPANY GENERAL INFORMATION"]
[]
[null,"PREPARED BY:",null,null,"DATE:"]
{"$rows_left_out":195}
{"sheet":"PuestosIndustriaProceso_Catalog","index":17,"n_rows":307,"n_cols":6,"rows_kept":307,"cut":false,"hidden":true,"merged":[]}
[]
["Pos","Clase","DatosLabor","Nivel","Meses","Progresion"]
[{"$f":"IF(B3<>\"\",IF(B2=\"Clase\",1,A2+1),\"\")","v":""},{"$f":"IF(ISERROR(INDEX(Clase_PositionCatalog,ROW()-ROW(B$2))),\"\",INDEX(Clase_PositionCatalog,ROW()-ROW(B$2)))","v":""},{"$f":"IF(ISERROR(INDEX(Position_PositionCatalog,ROW()-ROW(C$2))),\"\",INDEX(Position_PositionCatalog,ROW()-ROW(C$2)))","v":""},{"$f":"IF(ISERROR(INDEX(NumPuesto_PositionCatalog,ROW()-ROW(D$2))),\"\",INDEX(NumPuesto_PositionCatalog,ROW()-ROW(D$2)))","v":""},{"$f":"IF(ISERROR(INDEX(Meses_PositionCatalog,ROW()-ROW(E$2))),\"\",INDEX(Meses_PositionCatalog,ROW()-ROW(E$2)))","v":""},{"$f":"IF(ISERROR(INDEX(Progresion_Positioncatalog,ROW()-ROW(F$2))),\"\",INDEX(Progresion_Positioncatalog,ROW()-ROW(F$2)))","v":""}]
[{"$f":"IF(B4<>\"\",IF(B3=\"Clase\",1,A3+1),\"\")","v":""},"","","","",""]
["","","","","",""]
["","","","","",""]
{"$rows_left_out":302}
{"sheet":"PuestosIndustriaProceso","index":18,"n_rows":283,"n_cols":6,"rows_kept":283,"cut":false,"hidden":true,"merged":[]}
[null,{"$f":"NombreHoja","v":"ORGCH00"},null,{"$f":"IF(ISERROR(INDEX(INDIRECT(NombreHoja&\"!\"&B$2),1)),\"NO\",\"SI\")","v":"NO"}]
["Pos","Clase","DatosLabor","Nivel","Meses","Progresion"]
[{"$f":"IF(B3<>\"\",IF(B2=\"Clase\",1,A2+1),\"\")","v":""},{"$f":"IF(ISERROR(INDEX(INDIRECT(NombreHoja&\"!\"&B$2),ROW()-ROW(B$2))),IF(ExisteOrgChart=\"NO\",IF(ISERROR(INDEX(Clase_PositionCatalog,ROW()-ROW(B$2))),\"\",INDEX(Clase_PositionCatalog,ROW()-ROW(B$2))),\"\"),INDEX(INDIRECT(NombreHoja&\"!\"&B$2),ROW()-ROW(B$2)))","v":""},{"$f":"IF(ISERROR(INDEX(INDIRECT(NombreHoja&\"!\"&C$2),ROW()-ROW(C$2))),IF(ExisteOrgChart=\"NO\",IF(ISERROR(INDEX(Position_PositionCatalog,ROW()-ROW(C$2))),\"\",INDEX(Position_PositionCatalog,ROW()-ROW(C$2))),\"\"),INDEX(INDIRECT(NombreHoja&\"!\"&C$2),ROW()-ROW(C$2)))","v":""},{"$f":"IF(ISERROR(INDEX(INDIRECT(NombreHoja&\"!\"&D$2),ROW()-ROW(D$2))),IF(ExisteOrgChart=\"NO\",IF(ISERROR(INDEX(NumPuesto_PositionCatalog,ROW()-ROW(D$2))),\"\",INDEX(NumPuesto_PositionCatalog,ROW()-ROW(D$2))),\"\"),INDEX(INDIRECT(NombreHoja&\"!\"&D$2),ROW()-ROW(D$2)))","v":""},{"$f":"IF(ISERROR(INDEX(INDIRECT(NombreHoja&\"!\"&E$2),ROW()-ROW(E$2))),IF(ExisteOrgChart=\"NO\",IF(ISERROR(INDEX(Meses_PositionCatalog,ROW()-ROW(E$2))),\"\",INDEX(Meses_PositionCatalog,ROW()-ROW(E$2))),\"\"),INDEX(INDIRECT(NombreHoja&\"!\"&E$2),ROW()-ROW(E$2)))","v":""},{"$f":"IF(ISERROR(INDEX(INDIRECT(NombreHoja&\"!\"&F$2),ROW()-ROW(F$2))),IF(ExisteOrgChart=\"NO\",IF(ISERROR(INDEX(Progresion_Positioncatalog,ROW()-ROW(F$2))),\"\",INDEX(Progresion_Positioncatalog,ROW()-ROW(F$2))),\"\"),INDEX(INDIRECT(NombreHoja&\"!\"&F$2),ROW()-ROW(F$2)))","v":""}]
["","","","","",""]
["","","","","",""]
["","","","","",""]
{"$rows_left_out":278}
{"sheet":"Listas","index":19,"n_rows":38,"n_cols":20,"rows_kept":38,"cut":false,"hidden":true,"merged":[]}
[null,null,null,null,null,null,null,null,null,null,null,null,null,null,"Transportation Media",null,"InboundCustomLand","OutBoundCustomLand","OutboundCustomSea","OperationCityTarget"]
[null,"YESNO","CostBse","UnidadArea","Ciudades","Industrias","NombreIndustria","Procesos","NombreProcesos","Industria",{"$f":"'Shelter Services Questionnaire'!$C$30","v":"- Select -"},null,"ShowYearlyMonthlyTotalsList",null,"- Select media",null,"- Select port","- Select port","- Select port","- Select port"]
[null,"- Select -","- Select -","- Select Unit Measure","- Select -","- Select -",null,"- Select -",null,"NombreIndusria",{"$f":"INDEX(NombreIndustrias,MATCH(K2,Industrias,0))","v":0},null,"Yearly Totals",null,"Land",null,"El Paso","Juarez","Altamira","Chihuahua"]
[null,"YES","Q1","Square feet","El Paso","Aerospace","AEROSPACE","Assembly","ASSEMBLY","Proceso",{"$f":"'Shelter Services Questionnaire'!$C$32","v":"- Select -"},null,"Monthly Totals",null,"Sea",null,"Brownsville","Matamoros","Lázaro Cárdenas","Bajio"]
[null,"NO","MED","Square meter","Laredo","Automotive","AUTOMOTIVE","Machining","MACHINING","NombreProceso",{"$f":"INDEX(NombreProcesos,MATCH(K4,Procesos,0))","v":0},null,null,null,null,null,"Laredo","Nogales","Manzanillo","Guadalajara"]
[null,null,"Q3",null,"Reynosa","Chemical","CHEMICAL","Metal Mechanic","METALMECHANIC","NombreHoja",{"$f":"\"ORGCH\"&K3&K5","v":"ORGCH00"},null,null,null,null,null,"McAllen","Nuevo Laredo","Mazatlán","Juarez"]
{"$rows_left_out":33}
{"sheet":"Currencies","index":20,"n_rows":7,"n_cols":4,"rows_kept":7,"cut":false,"hidden":true,"merged":[]}
["Country","Flag","Currency","Currency Sign"]
["Canada",null,"Canadian Dólar","CAND"]
["China",null,"Chinese Yuan","CNY"]
["United States",null,"United States Dollar","USD"]
["Europe",null,"Euro","EUR"]
["Japan",null,"Japanese Yen","JPY"]
{"$rows_left_out":1}